Hi Andrea,

Do you have a new Mac with the M1 chip ? If so you might want to install Rosetta first.

Best,
Phil


On 4 Aug 2021, at 22:20, Andrea Corna via Therion <therion@speleo.sk> wrote:

Hi Guys, 
I’m trying ti install on Mac OS 11.4 but I’m failing.
Compiling fron GitHub also fail:

ld: symbol(s) not found for architecture x86_64
clang: error: linker command failed with exit code 1 (use -v to see invocation)
make[1]: *** [loch] Error 1
make: *** [loch/loch] Error 2

Anyone is able to install?

Thanks for help

Andrea
_______________________________________________
Therion mailing list
Therion@speleo.sk
https://mailman.speleo.sk/listinfo/therion